编号,入院时间,现住址,床号,姓名,联系电话,身高,体重,BMI,年龄,性别,职业,文化水平：0 初中及以下，1高中，2本科，3研究生,疫苗接种剂次,第一针时间,第二针时间,第三针时间,阴性同住人疫苗接种剂次,基础病：0无，1COPD，2哮喘，3支扩，4ILD，5慢支，6肺癌，7其他肺部疾病，8心脑血管，9内分泌，10泌尿，11消化，12风湿免疫，血液，13其他,确诊时间,确诊前上一次核酸阴性时间,阳性核酸采样方式1鼻拭子，2咽拭子，3均做,确诊期间抗原结果0阴性，1阳性,有无症状0无，1流涕，2头晕，3咽痛，4发热，5咳嗽，6腹泻，7其他,症状出现与核酸阳性间隔时间(d),隔离场所性质：1单人单间单卫，2单人单间共卫，3多人混住，4其他,隔离场所人均面积,开窗通风：1.否，2是,家庭成员是否直接接触：0否，1是,用药应用：0无，1莲花清瘟，2退热药，3抗生素，4感冒药,物资消杀：0否，1是,上游来源分组：1.同住人，2公共区域；3未知,与患者关系：0未知，1室友，2祖辈，3父母，4配偶，5兄弟姐妹，6子女，7孙辈，8公共区域暴露,性别：1男，2女,年龄.1,基础病：0无，1COPD，2哮喘，3支扩，4ILD，5慢支，6肺癌，7其他肺部疾病，8心脑血管，9内分泌，10泌尿，11消化，12风湿免疫，血液，13其他.1,文化水平：0 初中及以下，1高中，2本科，3研究生.1,职业.1,疫苗接种剂次.1,第一针时间.1,第二针时间.1,第三针时间.1,确诊时间.1,症状：0无，1流涕，2头晕，3咽痛，4发热，5咳嗽，6腹泻，7其他,与上游关系：0未知，1室友，2祖辈，3父母，4配偶，5兄弟姐妹，6子女，7孙辈，8公共区域暴露,性别：1男，2女.1,年龄.2,基础病：0无，1COPD，2哮喘，3支扩，4ILD，5慢支，6肺癌，7其他肺部疾病，8心脑血管，9内分泌，10泌尿，11消化，12风湿免疫，血液，13其他.2,文化水平：0 初中及以下，1高中，2本科，3研究生.2,职业.2,疫苗接种剂次.2,第一针时间.2,第二针时间.2,第三针时间.2,确诊时间.2,症状：0无，1流涕，2头晕，3咽痛，4发热，5咳嗽，6腹泻，7其他.1,下游传播人数（下游共多少个人因为她感染）,与患者关系：0未知，1室友，2祖辈，3父母，4配偶，5兄弟姐妹，6子女，7孙辈，8公共区域暴露.1,疫苗接种剂次.3,第一针时间.3,第二针时间.3,第三针时间.3,确诊时间.3,症状：0无，1流涕，2头晕，3咽痛，4发热，5咳嗽，6腹泻，7其他.2,性别：1男，2女.2,年龄.3,基础病：0无，1COPD，2哮喘，3支扩，4ILD，5慢支，6肺癌，7其他肺部疾病，8心脑血管，9内分泌，10泌尿，11消化，12风湿免疫，血液，13其他.3,文化水平：0 初中及以下，1高中，2本科，3研究生.3,职业.3,可能轨迹暴露,家庭关系,备注,Unnamed: 72,Unnamed: 73,Unnamed: 74,Unnamed: 75,Unnamed: 76,Unnamed: 77,Unnamed: 78,Unnamed: 79,Unnamed: 80,Unnamed: 81,Unnamed: 82,Unnamed: 83,Unnamed: 84,Unnamed: 85,Unnamed: 86
1.0,2022-04-12 00:31:27,上海市-上海市-杨浦区国和路209号文祥公寓216,FK-B-49,刘欣,13204441792,,,,27,1,保安,1.0,3,2021.5.19,2021.6.10,2021.12.18,"3,未知",0 无,2022.4.10,2022.4.7,"1,2",1,4,-2,3,6.6,0.0,1,1,1.0,1,1,1,26,0,1,保安,3,2021.3.9,2021.3.30,2022.2.22,,"3,4,7(乏困，四肢酸痛无力)",,,,,,,,,,,,,,,,,,,,,,,,,,,,,,,,,,,,,,,,,,,
2.0,2022-04-12 00:34:09,上海市-上海市-杨浦区杨浦区殷行街道,FK-B-50,王阳,18904465312,,,,35,1,保安,1.0,3,2021.4.4,2021.4.27,2021.10.28,"3,未知",0 无,2022.4.10,2022.4.7,"1,2",1,5咳嗽,-1,3,6.6,0.0,1,1,1.0,3,,,,,,,,,,,,,,,,,,,,,,,,,,,,,,,,,,,,,,,,,,,,,,,,,,,,,,,
3.0,2022-04-12 00:36:23,上海市-上海市-杨浦区虬江码头83号,FK-B-51,付超,13632764094,1.68,80.0,28.344671201814062,47,1,保安,0.0,3,2021.4.27,2021.6.14,2022.1.6,2，未知,0,2022.4.10,2022.4.2,1,1,7（鼻塞）,1,3,2,1.0,1,1,1.0,1,1,1,20,0,,保安,,,,,,,,,,,,,,,,,,,,,,,,,,,,,,,,,,,,,,,,,,,,,,,,,
4.0,2022-04-12 00:32:55,上海市-上海市-杨浦区殷行街道,FK-B-52,胡杰,18658403059,1.8,75.0,23.148148148148145,25,1,保安,1.0,2,2021.4.13,2021.5.4,,7，未知,0,2022.4.8,2022.4.4,2,1,"3,5",1,3,2.857142857142857,1.0,1,1,0.0,1,1,1,50+,0,,保安,,,,,,5,,,,,,,,,,,,,,,,,,,,,,,,,,,,,,,,,,,,,,,,,,,
5.0,2022-04-12 11:25:43,上海市-上海市-杨浦区控江街道控江六村24号504室,FK-B-53,冯守建,19921867911,1.7,70.0,24.221453287197235,67,1,退休,0.0,3,,,2022.1,0,11,2022.4.9,2022.4.1,2,0,4,-1,2,30,1.0,1,1,0.0,3,,,,,,,,,,,,,,,,,,,,,,,,,,,,,,,,,,,,,,,,,,,,,,,,,,,,,,,
6.0,2022-04-12 11:21:09,上海市-上海市-杨浦区黄兴路1100号,FK-B-54,阿力木,15292904090,1.7,68.0,23.529411764705884,30,1,个体,0.0,2,2021.5.10,2021.6.20,,4，未知,0,2022.4.10,2022.4.9,"1,2",,0,,3,4,0.0,1,0,0.0,3,,,,,,,,,,,,,,,,,,,,,,,,,,,,,,,,,,,,,,,,,,,,,,,,,,,,,,,
7.0,2022-04-12 11:18:16,上海市-上海市-杨浦区江浦路街道本溪路137号,FK-B-55,叶海军,15757085869,1.74,69.0,22.79032897344431,43,1,菜鸟驿站,0.0,3,2021.4,2021.5,2022.3.22,"7，,3",0,2022.4.9,2022.4.6,2,,2,1,1,3,0.0,0,1,1.0,3,,,,,,,,,,,,,,,,,,,,,,,,,,,,,,,,,,,,,,,,,,,,,,,,,,,,,,,
8.0,2022-04-12 11:28:30,上海市-上海市-杨浦区控江街,FK-B-56,夏铋达,18221620847,1.72,70.0,23.66143861546782,64,1,退休,1.0,3,2021.6.2,2021.6.24,2022.1.16,"1,3",8，11,2022.4.9,2022.4.5,"1,2",,0,,3,8,1.0,1,0,0.0,3,,,,,,,,,,,,,,,,,,,,,,,,,,,,,,,,,,,,,,,,,,,,,,,,,,,,,,,
9.0,2022-04-12 11:16:24,上海市-上海市-杨浦区控江路街道,FK-B-57,冯宏顺,15901819807,1.76,66.0,21.306818181818183,22,1,运输,1.0,2,2021.8.4,2021.8.25,,"2（0,2）",0,2022.4.9,2022.4.6,2,1,4,1,3,15,0.0,0,1,0.0,2,8,,,,,,,,,,,,,,,,,,,,,,,,1,3,0,,,,2022.4.10,4，7（脓痰）,2女,45,糖尿病,1,工人,,,,,,,,,,,,,,,,,,
10.0,2022-04-12 11:24:25,上海市-上海市-杨浦区控江衔道，104弄34号甲504,FK-B-58,张萍,18964041692,1.73,61.0,20.38156971499215,59,1,司机,1.0,3,2021.4.22,2021.5.24,2021.11.28,"2,0,0",8,2022.4.10,2022.4.7,1,0,4，5,1,3,12,1.0,1,1,0.0,2,8,,,,,,,,,,,,,,,,,,,,,,,,1,4,0,,,,2022.4.11,4,2女,59,0,1,退休,,,,,,,,,,,,,,,,,,
11.0,2022-04-12 11:22:03,上海市-上海市-杨浦区控江街道,FK-B-59,王志洲,13162340091,1.62,60.0,22.862368541380885,59,1,无业,0.0,3,2021.3.21,2021.5.19,2021.12.16,"1,0",8,2022.4.9,2022.4.6,3,0,5,-2,3,5,1.0,1,1,0.0,3,0,,,,,,,,,,,,,,,,,,,,,,,,,,,,,,,,,,,,,,,,,,,,,,,,,,,,,,
12.0,2022-04-12 11:41:16,上海市-上海市-杨浦区控江路1029号,FK-B-60,王启伟,13105375299,,,,56,1,保安,0.0,3,2021.5.29,2021.7.24,2022.2.5,0,0,2022.4.10,2022.4.4,,1,4,-1,2,7,1.0,0,1,1.0,1,1,,,,,,,,,,,,,,,,,,,,,,,,,,,,,,,,,,,,,,,,,,,,,,,,,,,,,,
13.0,2022-04-12 11:36:00,上海市-上海市-杨浦区杨浦区长海街道世界路市京一村64/201,FK-B-61,张国荣,13636353179,1.7,63.0,21.79930795847751,57,1,物业,1.0,2,2021.6.9,2021.6.30,,,0,2022.4.9,2022.4.6,2,1,5,1,2,4,1.0,0,1,0.0,2,8,1,60,,,保安,,,,,,0,,,,,,,,,,,,,,,,,,,,,,,,,,,,,,,,,,,,,,,,,,,
14.0,2022-04-12 11:24:48,上海市-上海市-杨浦区控江,FK-B-62,徐国榛,15026649924,,,,14,1,学生,0.0,2,,,,1，未知,0,2022.4.12,2022.4.11,,1,0,,3,60,1.0,1,1,0.0,2,8,,,,,,,,,,,,,,,,,,,,,,,,,,,,,,,,,,,,,,,,,,,,,,,,,,,,,,
15.0,2022-04-12 11:29:41,上海市-上海市-杨浦区控江街道,FK-B-63,汤和喜,13524218720,1.74,82.0,27.08415906989034,69,1,退休,0.0,3,2021.4.11,2021.5.7,2021.12.23,1，3,0,2022.4.9,2022.4.6,2,0,0,,3,30,1.0,1,1,1.0,3,,,,,,,,,,,,,,,,,,,,,,,,,,,,,,,,,,,,,,,,,,,,,,,,,,,,,,,
16.0,2022-04-12 16:18:31,上海市-上海市-杨浦区江浦路1285弄,FK-B-64,贺选保,13052183310,1.6,70.0,27.34375,51,1,无业,0.0,2,,,,7，3,0,2022.4.10,2022.4.9,2,0,7（四肢乏力）,1,3,5.714285714285714,1.0,1,1,0.0,1,4,2,48,0,0,无业,3,,,,,7（头痛，四肢乏力）,6,2,23,0,0,个体,3,,,,,7,,,,,,,,,,,,,,,,,,,,,,,,,,,,,,,
17.0,2022-04-12 13:47:28,上海市-上海市-杨浦区杨浦区大桥街道双阳路109号,FK-B-65,张建康,13162716016,1.67,62.5,22.410269281795692,57,1,自由职业,0.0,3,2021.4.29,2021.5.29,2022.1.2,全部感染,0,2022.4.10,2022.4.8,2,0,"1,4",-2,3,4.5,1.0,1,1,0.0,2,8,1,50,,,个体户,,,,,,,,,,,,,,,,,,,3,1,"1,3  1,2  1,0",,,,"2022.4.15,2022.4.16","0 ,3,5",1,"56，51,47",0,0,自由职业,,,,,,,,,,,,,,,,,,
18.0,2022-04-12 13:46:42,上海市-上海市-杨浦区大桥街道杨树浦路1455弄19号,FK-B-66,刘福宝,15001936517,1.66,75.0,27.21730294672667,74,1,退休,0.0,3,2021.6.5,2021.6.29,2021.12.22,全部感染,0,2022.4.9,2022.4.6,1,1,5,1,3,25,1.0,1,0,0.0,2,8,,,,,,,,,,,,,,,,,,,,,,,,2,"4,6",2，3,,,,2022.4.13,0，4,"2,1","75,46",0，8,"0,1",工人，保安,,,,,,,,,,,,,,,,,,
19.0,2022-04-12 13:41:30,上海市-上海市-杨浦区长阳路2087弄33号103室,FK-B-67,应志勤,15821186021,1.76,65.0,20.983987603305785,70,1,退休,0.0,3,,,2022.2.15,,7（肺气肿）,2022.4.9,2022.4.1,1,1,2，7（乏力）,1,1,46,1.0,0,1,0.0,3,0,,,,,,,,,,,,,,,,,,,,,,,,,,,,,,,,,,,,,,,,,,,,,,,,,,,,,,
20.0,2022-04-12 13:39:38,上海市-上海市-杨浦区平凉路1359弄2号302,FK-B-68,许岩,13818615680,1.85,85.0,24.835646457268076,41,1,办公室职员,2.0,2,2021.6.4,2021.6.27,,"2，,2",0,2022.4.10,2022.4.9,2,0,"4,6",1,3,30,1.0,0,1,1.0,3,0,,,,,,,,,,,,,,,,,,,,,,,,,,,,,,,,,,,,,,,,,,,,,,,,,,,,,,
21.0,2022-04-12 13:41:23,上海市-上海市-黄浦区杨浦区大桥街道宁武路269号舜君企业园,FK-B-69,张军伟,13140742658,1.75,73.0,23.836734693877553,24,1,服务员,0.0,2,2021.7.5,2021.7.30,,6，未知,0,2022.4.9,2022.4.8,,1,2，7（肌肉酸痛）,-2,3,5,1.0,1,0,1.0,3,0,,,,,,,,,,,,,,,,,,,,,,,,,,,,,,,,,,,,,,,,,,,,,,,,,,,,,,
22.0,2022-04-12 13:39:10,上海市-上海市-杨浦区大桥街道,FK-B-70,林乐,18616655116,1.8,82.0,25.308641975308642,40,1,广告公司,1.0,1(重组型疫苗，一针剂),2021.6.23,,,全部感染,0,2022.4.12,,2022-04-06 00:00:00,1,"3,5",1,3,45,1.0,1,1,1.0,1,4,2,36,0,3,职员,2,,,,,3，5,,,,,,,,,,,,,,,,,,,,,,,,,,,,,,,,,,,,,,,,,,,
23.0,2022-04-12 13:43:34,上海市-上海市-杨浦区大桥街道,FK-B-71,李彬,18616043918,1.76,75.0,24.212293388429753,38,1,个体,0.0,2,2021.6.4,2021.6.30,,全部感染,0,2022.4.11,未做,1,1,2,-1,3,12,0.0,1,1,1.0,1,4,2,39,0,0,个体户,3,,,,,4,,,,,,,,,,,,,,,,,,,,,,,,,,,,,,,,,,,,,,,,,,,
24.0,2022-04-12 13:43:46,上海市-上海市-杨浦区大桥,FK-B-72,刘维,15821610569,1.72,65.0,21.97133585722012,32,1,职员,2.0,2,2021.3.29,2021.4.24,,0,0,2022.4.10,2022.4.4,2,1,3，4，5,-2,1,100,1.0,0,0,0.0,3,0,,,,,,,,,,,,,,,,,,,,,,,,,,,,,,,,,,,,,,,,,,,,,,,,,,,,,,
25.0,2022-04-12 13:46:55,上海市-上海市-杨浦区大桥街道,FK-B-73,陈明,15221249599,1.78,70.0,22.093170054286077,48,1,职员,0.0,3,2021.3.19,2021.4.14,2021.11.9,全部感染,0,2022.4.7,2022.4.4,未知,0,7（头痛，乏力）,2,3,35,1.0,1,0,0.0,1,4,2,47,0,1,物业,1,,,,,"3，5,7（头痛)",,,,,,,,,,,,,,,,,,,,,,,,,,,,,,,,,,,,,,,,,,,
26.0,2022-04-12 13:50:44,上海市-上海市-杨浦区大桥街道,FK-B-74,张凑平,13248354303,1.7,70.0,24.221453287197235,47,1,外卖,0.0,1,未知,,,"1,3",0,2022.4.8,2022.4.7,2,1,4,0.5,3,5,1.0,0,1,0.0,3,0,,,,,,,,,,,,,,,,,,,,,,,,,,,,,,,,,,,,,,,,,,,,,,,,,,,,,,
27.0,2022-04-12 16:22:30,上海市-上海市-杨浦区双辽路200弄26号504,FK-B-75,王才清,18016452717,1.65,70.0,25.71166207529844,69,1,退休,0.0,2,2021.5.30,2021.6.21,,全部感染,0,2022.4.10,2022.4.8,3,0,0,,3,20,1.0,1,0,0.0,2,8,2,60,,,退休,,,,,,未知,,,,,,,,,,,,,3,"4,6,7","2,3  1,1",,,,2022.4.14,0,"2,2,2","65,45,9",0,"0,2,0",退休，干部，学生,,,,,,,,,,,,,,,,,,
28.0,2022-04-12 16:26:44,上海市-上海市-杨浦区辽源西路239弄14号,FK-B-76,陈勇青,13788930231,1.62,65.0,24.76756591982929,68,1,退休,0.0,0,,,,"1，3  1,2",0,2022.4.10,2022.4.7,2,1,"4,5,6",1,3,25,1.0,0,1,1.0,3,0,,,,,,,,,,,,,,,,,,,,,,,,,,,,,,,,,,,,,,,,,,,,,,,,,,,,,,
29.0,2022-04-12 16:31:38,上海市-上海市-杨浦区平凉街道,FK-B-77,石耀武,13707644839,1.73,70.0,23.38868655818771,57,1,物业,1.0,3,2021.3.15,2021.4.10,2021.12.1,3，3,0,",2022.4.10",2022.4.10,1,1,3,-1,3,35,1.0,1,1,1.0,3,0,,,,,,,,,,,,,,,,,,,,,,,,,,,,,,,,,,,,,,,,,,,,,,,,,,,,,,
30.0,2022-04-12 16:27:57,上海市-上海市-杨浦区平凉路街道霍山路1191弄10号505,FK-B-78,蔡鹏,13163219233,1.65,68.0,24.977043158861342,33,1,个体,1.0,3,2021.4.24,2021.5.23,2021.10.25,全部感染,0,2022.4.11,2022.4.10,3,0,7（嗓子干）,0.5,3,4,1.0,1,0,0.0,1,1,1,27,0,1,个体户,2,,,,,1,,,,,,,,,,,,,,,,,,,,,,,,,,,,,,,,,,,,,,,,,,,
31.0,2022-04-12 14:03:54,上海市-上海市-杨浦区鞍山三村35-13,FK-B-79,金柏锟,15021876281,1.79,75.0,23.407509128928563,26,1,律师,2.0,2,2021.4.30,2021.5.28,,,0,2022.4.7,2022.4.5,2,1,4,0.5,1,40,1.0,0,1,1.0,3,0,,,,,,,,,,,,,,,,,,,,,,,,,,,,,,,,,,,,,,,,,,,,,,,,,,,,,,
32.0,2022-04-11 22:07:38,上海市-上海市-杨浦区定海街道,FK-B-80,陈松年,13162179753,1.8,90.0,27.77777777777778,68,1,退休,0.0,3,2021.7,2021.8,2022.2.16,全部感染,0,2022.4.7,2022.4.2,1,1,5,1,3,8,1.0,1,0,0.0,3,0,,,,,,,,,,,,,,,,,,,,,,,,,,,,,,,,,,,,,,,,,,,,,,,,,,,,,,
33.0,2022-04-11 21:57:05,上海市-上海市-杨浦区定海路街道,FK-B-81,张隆瑚,17821857745,1.85,88.0,25.712198685171657,26,1,职员,1.0,3,2021.4.16,2021.5.15,2021.11.20,"2,3",0,2022.4.7,2022.4.6,3,1,"3,4",0.5,2,8,1.0,0,1,0.0,3,0,,,,,,,,,,,,,,,,,,,,,,,,,,,,,,,,,,,,,,,,,,,,,,,,,,,,,,
34.0,2022-04-11 22:25:30,上海市-上海市-杨浦区楊浦区淀海街道平凉路1976弄5号4O2,FK-B-82,刘恒生,13127996533,1.65,65.0,23.875114784205696,72,1,退休,0.0,3,2021.4.8,2021.4.29,2021.11.2,,8,2022.4.7,2022.4.1,2,1,"4,7(四肢酸痛)",-1,1,14,1.0,1,2,0.0,2,8,,,,,,,,,,,,,,,,,,,,,,,,,,,,,,,,,,,,,,,,,,,,,,,,,,,,,,
35.0,2022-04-11 21:58:24,上海市-上海市-杨浦区定海街道,FK-B-83,田临岑,13788911268,1.77,80.0,25.535446391522232,32,1,职员,2.0,2,2021.6.5,2021.6.26,,"2,2 2,0",0,2022.4.7,2022.4.4,2,1,4,-3,2,15,1.0,0,1,0.0,2,8,,,,,,,,,,,,,,,,,,,,,,,,,,,,,,,,,,,,,,,,,,,,,,,,,,,,,,
36.0,2022-04-11 21:58:35,上海市-上海市-杨浦区顺平路59弄,FK-B-84,包政,13818161838,1.65,45.0,16.528925619834713,41,1,零售,1.0,2,2021.6.8,2021.6.29,,"1,2",0,2022.4.11,2022.4.1,2,1,4,-4,1,12,1.0,0,2,0.0,2,8,,,,,,,,,,,,,,,,,,,,,,,,,,,,,,,,,,,,,,,,,,,,,,,,,,,,,,
37.0,2022-04-11 22:22:02,上海市-上海市-杨浦区杨浦区顺平路59弄13号1805室,FK-B-85,杨晓啼,13062760403,1.66,64.0,23.225431847873423,73,1,退休,1.0,3,2021.3,2021-4,2021.10,"1,3",8,2022.4.10,2022.4.6,1,1,"3,4",-2,3,30,1.0,1,1,1.0,3,0,,,,,,,,,,,,,,,,,,,,,,,,,,,,,,,,,,,,,,,,,,,,,,,,,,,,,,
38.0,2022-04-11 21:57:27,上海市-上海市-杨浦区定海路街道,FK-B-86,封国鹏,15317921038,1.71,60.0,20.519134092541297,26,1,职员,2.0,3,2021.4.17,2021.5.8,2021.12.5,2，2,0,2022.4.10,2022.4.6,3,1,"1，4,5",-7,2,12,1.0,0,1,0.0,3,0,,,,,,,,,,,,,,,,,,,,,,,,,,,,,,,,,,,,,,,合租室友，封国鹏传染，4人阳,,,,,,,,,,,,,,,
39.0,2022-04-11 21:59:52,上海市-上海市-杨浦区定海路,FK-B-87,黄煜族,13764652792,1.75,61.0,19.918367346938773,21,1,职员,1.0,2,2021.3.23,2021.4.27,,2，2,0,2022.4.10,2022.4.6,1,1,2，3，4,-3,3,7,1.0,1,1,0.0,1,1,1,26,0,2,职员,3,2021.4.17,2021.5.8,2021.12.5,2022.4.10,"1,4,5",,,,,,,,,,,,,,,,,,,,,,,,,,,,,,,,,,,,,,,,,,,
40.0,2022-04-11 21:59:57,上海市-上海市-杨浦区定海路,FK-B-88,黄煜文,13504112729,1.79,61.0,19.038107424861895,21,1,职员,1.0,3,2021.4.2,2021.4.23,2022.3.11,2，2,0,2022.4.10,2022.4.6,1,1,"1,2,4,5",-3,3,7,1.0,1,1,0.0,1,1,1,26,0,2,职员,3,2021.4.17,2021.5.8,2021.12.5,2022.4.10,"1,4,5",,,,,,,,,,,,,,,,,,,,,,,,,,,,,,,,,,,,,,,,,,,
41.0,2022-04-11 21:54:00,上海市-上海市-杨浦区定海街道,FK-B-89,薛明,13917550509,1.74,80.0,26.42356982428326,39,1,职员,2.0,0,,,,,0,2022.4.9,2022.4.5,3,1,4,-2,2,9,1.0,0,1,1.0,1,3,2,67,0,0,退休,2,,,,2022.4.6,5，7（咳痰）,,,,,,,,,,,,,,,,,,,,,,,,,,,,,,,,,,,,,,,,,,,
42.0,2022-04-11 22:00:48,上海市-上海市-杨浦区定海路街道11号楼905,FK-B-90,林保少,15901839949,1.76,88.0,28.40909090909091,50,1,保安,0.0,3,2021.5.8,2021.5.29,2022.1.6,"1,3",0,2022.4.4,2022.4.1,2,1,0,,2,10,1.0,0,1,1.0,2,8,1,52,,,保安,3,,,,2022.3.31,,,,,,,,,,,,,,,,,,,,,,,,,,,,,同事传染患者,,,,,,,,,,,,,,,
43.0,2022-04-11 21:45:20,上海市-上海市-杨浦区锦西路100弄4号202,FK-B-91,陆长顺,13816097313,1.71,56.0,19.151191819705208,62,1,退休,1.0,3,2021.6,2021.7,2022.1,"1,3",0,2022.4.9,2022.4.5,3,0,",0",,1,30,1.0,1,1,0.0,1,4,2,60,0,,退休,3,,,,,,,,,,,,,,,,,,,,,,,,,,,,,,,,,,,,,,,,,,,,,,,,
44.0,2022-04-11 21:45:28,上海市-上海市-杨浦区四平路街道鞍山六村,FK-B-92,郭鹏,18621808758,1.85,80.0,23.37472607742878,26,1,职员,3.0,2,2021.6.3,2021.7.3,,"1,2",0,2022.4.9,2022.4.8,3,1,3，4,-1,3,15,1.0,1,1,0.0,3,0,,,,,,,,,,,,,,,,,,,,,,,,,,,,,,,,,,,,,,,,,,,,,,,,,,,,,,
45.0,2022-04-11 21:51:29,上海市-上海市-杨浦区四平衔道锦西路100弄2号,FK-B-93,杨根发,13023115952,1.6,54.0,21.09375,57,1,工人,1.0,3,2021.4,2021.5,2021.12,全部感染,0,2022.4.9,2021.4.5,3,1,"1,3",-1,3,16,1.0,0,1,1.0,1,6,2,32,0,2,职员,0,,,,2022.4.4,"1,3,4",3,2,58,0,1,退休,3,,,,2022.4.3,"1,3,4",,,,,,,,,,,,,,,,上上游是李美玲。女儿杨俪传染给患者,,,,,,,,,,,,,,,
46.0,2022-04-11 21:51:29,上海市-上海市-杨浦区四平路街道抚顺路363弄13号502,FK-B-94,徐荣华,13661791793,1.65,57.5,21.12029384756658,58,1,保安,1.0,2,2021.4,2021.9,,1，2,8,2022.4.9,2021.4.6,3,1,"1，4，,5",-2,3,10,1.0,0,2,1.0,2,8,,,,,,,,,,,,,,,,,,,,,,,,,,,,,,,,,,,,,,,核酸采集时传染,,,,,,,,,,,,,,,
47.0,2022-04-11 21:47:00,上海市-上海市-杨浦区四平街道,FK-B-95,翁甲华,18021038049,1.7,72.0,24.913494809688583,77,1,退休,0.0,0,,,,全部感染,8,2022.4-8,2022.4.3,3,1,"4，,5",0.5,3,14,1.0,1,1,0.0,1,4,2,75,"8,9",0,退休,0,,,,2022.4.3,"3,4",8,,,,,,,,,,,,,,,,,,,,,,,,,,,上上游是菜场买菜,,,,,,,,,,,,,,,
48.0,2022-04-11 21:42:55,上海市-上海市-杨浦区四平街道,FK-B-96,王承良,13818849645,1.75,70.0,22.857142857142858,36,1,职员,2.0,2,2021.4.8,2021.4.29,,,0,2022.4.9,2022.4.6,3,1,"1，4,5",-1,2,30,1.0,1,1,0.0,1,4,,37,0,2,,,,,,2022.4.4,4,,,,,,,,,,,,,,,,,,,,,,,,,,,,,,,,,,,,,,,,,,,
49.0,2022-04-11 21:28:05,上海市-上海市-杨浦区殷行街道,FK-B-97,毕升,13585609883,1.68,80.0,28.344671201814062,45,1,职员,2.0,0,,,,,9,2022.4.10,2022.4.7,3,1,"3,4",-1,2,14,1.0,0,1,0.0,1,6,2,9,0,0,学生,0,,,,2022.4.6,4,3,2,41,0,1,职工,2,,,,2022.4.2,"3,4",,,,,,,,,,,,,,,,,,,,,,,,,,,,,,,
50.0,2022-04-11 21:41:58,上海市-上海市-杨浦区殷行街道闸殷路八号,FK-B-98,梁学习,15618372526,1.64,75.0,27.885187388459254,45,1,环卫,0.0,3,2021.4,2021.5,2021.11.19,"1,3",0,2022.4.9,2022.4.7,3,1,7（四肢酸痛）,1,3,40,1.0,0,1,1.0,2,8,1,43,0,,环卫,3,,,,2022.4.8,1，5,,,,,,,,,,,,,,,,,,,,,,,,,,,,同事（唐冠银）传染给患者,,,,,,,,,,,,,,,
51.0,2022-04-11 21:24:05,上海市-上海市-杨浦区殷行路七百六十五号,FK-B-99,张浩,17715617958,1.8,100.0,30.864197530864196,22,1,餐饮,0.0,2,2021.6.9,2021.7.30,,,0,2022.4.9,2022.4.8,3,1,"4,5",-1,1,4,1.0,1,0,1.0,2,8,2,45,,,美团买菜,,,,,2022.4.7,4,,,,,,,,,,,,,,,,,,,,,,,,,,,,同事，5人阳性，女性同事（美团买菜）传染,,,,,,,,,,,,,,,
52.0,2022-04-11 21:25:37,上海市-上海市-杨浦区殷行路765号,FK-B-100,钟国建,18302145770,1.7,72.0,24.913494809688583,31,1,餐饮,0.0,2,2021.3,2021.4,,,0,2022.4.9,2022.4.8,3,1,"4，,5",0.5,1,4,1.0,1,0,0.0,2,8,2,45,,,美团买菜,,,,,2022.4.7,4,,,,,,,,,,,,,,,,,,,,,,,,,,,,,,,,,,,,,,,,,,,
53.0,2022-04-15 14:04:11,上海市-上海市-杨浦区四平街道50弄45号302,FK-B-101,雷正辉,13918986288,1.82,57.5,17.359014611761864,71,1,退休,0.0,3,2021.4,2021.5,2021.12,"1,3",0,2022.4.12,2022.4.9,1,0,3,3,2,20,1.0,1,3,0.0,3,0,,,,,,,,,,,,,,,,,,,,,,,,,,,,,,,,,,,,,,,口罩佩戴不规范,,,,,,,,,,,,,,,
54.0,2022-04-11 21:44:22,上海市-上海市-杨浦区殷行街道,FK-B-102,王忠宝,13641746732,1.67,55.0,19.72103696798021,66,1,退休,0.0,3,2021.8,2021.9,2022.3.22,,0,2022.4.10,未做,3,1,4,-1,2,15,1.0,1,1,1.0,3,0,,,,,,,,,,,,,,,,,,,,,,,,1,4,3,,,,2022.4.12,"3,5",2,67,8,0,退休,,,当过社区志愿者,,,,,,,,,,,,,,,
55.0,2022-04-11 21:35:44,上海市-上海市-杨浦区杨浦区包头路872号,FK-B-103,罗炽金,13761392815,1.66,67.5,24.495572652054,53,1,物流,0.0,2,2021.8,2021.8.20,,,9,2022.4.9,2022.4.5,2,1,0,,1,6,0.0,1,1,1.0,1,4,2,,0,0,宾馆保洁,2,2021.3,2021.4,,2022.4.7,5,,,,,,,,,,,,,,,,,,,,,,,,,,,,,,,,,,,,,,,,,,,
56.0,2022-04-11 21:40:25,上海市-上海市-杨浦区殷行街道，国伟路,FK-B-104,王立田,15821585791,1.78,64.0,20.1994697639187,49,1,保安,0.0,3,2021.4.25,2021.5.25,2022.1,,0,2022.4.7,2022.3.29,2,1,4,0.5,3,3,1.0,1,1,0.0,1,4,2,47,0,0,服务员,3,,,,2022.4.5,4,8,2,40,,,个体,,,,,2022.4.1,3,,,,,,,,,,,,,,,,上上游是邻居,,,,,,,,,,,,,,,
57.0,2022-04-11 20:54:03,上海市-上海市-杨浦区松花江路40弄4号404室,FK-B-105,成国生,13162388127,1.68,68.0,24.09297052154195,55,1,司机,0.0,3,2021.1.13,2021.2.3,2022.1.11,,0,2022.4.7,2022.4.4,1,0,"1,3，4，5",-1,2,25,1.0,1,3,1.0,1,1,1,57,0,1,无业,3,,,2022.1,2022.4.6,"3,4",,,,,,,,,,,,,,,,,,,,,,,,,,,,,,,,,,,,,,,,,,,
58.0,2022-04-11 20:23:47,上海市-上海市-杨浦区长海路街道,FK-B-106,巩汉林,15024620515,,,,18,1,,,,,,,,,,,,,,,,,,,,,3,,,,,,,,,,,,,,,,,,,,,,,,,,,,,,,,,,,,,,,,,,,,,,,,,,,,,,,
59.0,2022-04-15 13:33:11,上海市-上海市-杨浦区控江街道控江6村8 号304 室,FK-B-107,叶心忠,13002125009,,,,63,1,退休,1.0,3,未知,,,全部感染,0,2022.4.11,2022.4.8,1,0,0,,3,4,1.0,1,1,1.0,1,4,2,58,9,0,退休,3,,,,2022.4.8,0,6,2,34,0,1,职员,3,,,,2022.4.4,0,,,,,,,,,,,,,,,,,,,,,,,,,,,,,,,
60.0,2022-04-11 19:41:00,上海市-上海市-杨浦区控江街道,FK-B-108,胡建华,13044633105,1.68,70.0,24.801587301587304,68,1,退休,0.0,2,2021.6,2021.7,,"1，3  1,2  1,0","8,9",2022.4.9,2022.4.1,3,1,3,0.5,3,10,1.0,1,0,1.0,2,8,,,,,,,,,,,,,,,,,,,,,,,,,,,,,,,,,,,,,,,核酸检测患者被感染,,,,,,,,,,,,,,,
61.0,2022-04-11 19:38:24,上海市-上海市-杨浦区控江路街道,FK-B-109,潘互乐,17317394023,1.75,70.0,22.857142857142858,70,1,退休,1.0,2,2021.6,2021.7,,1，0,8,2022.4.10,2022.4.4,3,1,3,-2,3,15,1.0,1,1,0.0,1,4,2,66,0,0,退休,2,2021.6,2021.7,,2022.4.6,3，4，5,,,,,,,,,,,,,,,,,,,,,,,,,,,,爱人去过菜场，当过社区志愿者,,,,,,,,,,,,,,,
62.0,2022-04-11 19:43:13,上海市-上海市-杨浦区控江,FK-B-110,叶鸣,13701982318,1.65,60.0,22.03856749311295,64,1,退休,0.0,3,2021.4.7,2021.5.13,2022.1.26,1，3,8,2022.4.10,2022.3.23,1,0,5，7（嗓子干）,-4,3,5,1.0,1,1,1.0,1,4,2,65,2,0,退休,3,,,,2022.4.2,5,,,,,,,,,,,,,,,,,,,,,,,,,,,,女儿戴口罩所以核酸阴性,,,,,,,,,,,,,,,
63.0,2022-04-11 19:32:27,上海市-上海市-杨浦区控江街道,FK-B-111,吴一清,13901639235,1.7,65.0,22.491349480968857,51,1,职员,2.0,3,2021-6,2021.7,2022.1.29,,2，8,2022.4.9,2022.4.1,1,1,",4",-5,2,14,1.0,1,1,0.0,1,4,2,48,0,1,无业,3,,,2021.12,2022.4.1,4,,,,,,,,,,,,,,,,,,,,,,,,,,,,,,,,,,,,,,,,,,,
64.0,2022-04-11 19:31:35,上海市-上海市-杨浦区控江凤城二村,FK-B-112,任正芳,18916131332,1.78,60.0,18.93700290367378,46,1,职员,1.0,3,2021.3,2021.4,2022.2.20,全部感染,0,2022.4.8,2022.4.4,3,0,"4,7（乏力）",-1,3,12,1.0,1,1,0.0,1,4,2,46,0,1,职员,3,,,,2022.4.3,"4,5",邻居,1,55,,,自由职业（装修）,,,,,2022.4.2,4,,,,,,,,,,,,,,,,,,,,,,,,,,,,,,,
65.0,2022-04-15 12:58:46,上海市-上海市-杨浦区鞍山三村,FK-C-113,刘根生,18019341039,1.65,75.0,27.54820936639119,63,1,退休,2.0,0,,,,全部感染,0,2022.4.13,2022.4.12,1,0,0,,3,6,1.0,1,1,0.0,1,6,1,17,0,1,学生,1,,,,2022.4.13,4,,,,,,,,,,,,,,,,,,,,,,,,,,,,,,,,,,,,,,,,,,,
66.0,2022-04-15 13:04:30,上海市-上海市-杨浦区鞍山四村第三小区,FK-C-114,李文化,13723226628,1.7,75.0,25.951557093425606,64,1,无业,0.0,0,,,,1，2,0,2022.4.9,2022.4.6,3,1,0,,3,15,1.0,1,1,1.0,3,0,,,,,,,,,,,,,,,,,,,,,,,,1,7,2,,,,2022.4.10,4,1,8,0,0,学生,,,,,,,,,,,,,,,,,,
67.0,2022-04-15 12:55:56,上海市-上海市-杨浦区四平路街道,FK-C-115,曹陵云,15801798648,1.66,75.0,27.21730294672667,50,1,派出所,1.0,3,2021.3.29,2021.4.26,2022.1.19,3，3,0,2022.4.14,2022.4.12,3,0,0,,3,5,1.0,1,0,1.0,2,8,1,30,0,1,民警,3,,,,2022.4.10,,,,,,,,,,,,,,,,,,,,,,,,,,,,,同事传染给患者,,,,,,,,,,,,,,,
68.0,2022-04-15 12:56:21,上海市-上海市-杨浦区四平街道,FK-C-116,张浩佳,15240177382,1.75,75.0,24.489795918367346,20,1,服务员,0.0,3,2021.5.19,2021.6.16,2021.12.19,全部感染,0,2022.4.10,2022.4.4,3,1,"1,5",2,3,15,1.0,1,1,0.0,1,1,1,20,1,,服务员,,,,,2022.4.10,3,1,2,50,,,服务员,,,,,2022.4.4,,,,,,,,,,,,,,,,,,,,,,,,,,,,,,,,
69.0,2022-04-15 12:54:03,上海市-上海市-杨浦区鞍山四寸第二小区49-19-,FK-C-117,杜睿,13659842844,1.81,76.0,23.198315069747565,31,1,工程师,2.0,0,,,,全部感染,0,2022.4.14,2022.4.10,3,1,"4，,5,6",0.5,3,45,1.0,1,1,1.0,2,8,,,,,,,,,,,,,,,,,,,,,,,,,,,,,,,,,,,,,,,室友，核酸检测时被传染,,,,,,,,,,,,,,,
70.0,2022-04-15 12:55:17,上海市-上海市-杨浦区四平路街道,FK-C-118,张益金,18627940600,1.7,60.0,20.761245674740486,33,1,职员,1.0,2,2021.5.1,2021.5.21,,全部感染,0,2022.4.14,2022.4.10,3,0,",0",,3,45,1.0,1,1,1.0,2,8,,,,,,,,,,,,,,,,,,,,,,,,,,,,,,,,,,,,,,,,,,,,,,,,,,,,,,
71.0,2022-04-15 13:04:02,上海市-上海市-杨浦区四平,FK-C-119,姜凤英,13916771120,1.6,65.0,25.390625,74,0,退休,1.0,2,2021,,,全部感染,0,2022.4.10,2022.4.6,2,0,0,,3,25,1.0,1,0,1.0,1,4,1,79,0,1,退休,2,,,,2022.4.10,7（声音嘶哑）,8,,,,,个体文体店,,,,,2022.4.3,,,,,,,,,,,,,,,,,夫妻，两人同住。邻居传染给丈夫。留的是儿子的电话,,,,,,,,,,,,,,,
72.0,2022-04-15 13:06:59,上海市-上海市-杨浦区四平街道,FK-C-120,李志祥,13916771120,1.68,70.0,24.801587301587304,79,1,退休,0.0,2,未知,,,全部感染,0,2022.4.10,2022.4.6,2,0,7（声音嘶哑）,-5,3,25,1.0,1,0,1.0,2,8,,,,,个体文体店,,,,,2022.4.3,,,,,,,,,,,,,,,,,,,,,,,,,,,,,,,,,,,,,,,,,,,,
73.0,2022-04-15 13:19:55,上海市-上海市-杨浦区共青路119弄1号,FK-C-121,丁科宝,13774293768,1.7,65.0,22.491349480968857,44,1,职员,1.0,3,2021.6.7,2021.6.28,2022.1.7,全部感染,0,2022.4.11,2022.4.9,3,1,3,1,3,5,1.0,0,1,0.0,1,6,1,12,0,0,学生,2,,,,2022.4.8,3，7（全身乏力）,8,,45,,,职员,,,,,2022.4.7,,,,,,,,,,,,,,,,,上上游是邻居,,,,,,,,,,,,,,,
74.0,2022-04-13 11:10:30,上海市-上海市-杨浦区共青路119弄,FK-C-122,袁允新,18217731569,1.65,60.0,22.03856749311295,63,1,退休,0.0,3,未知,,,全部感染,"8,9",2022.4.12,2022.4.10,1,0,0,,3,3,1.0,0,1,0.0,3,0,,,,,,,,,,,,,,,,,,,,,,,,1,1,,,,,2022.4.14,0,1,60,0,,职工,,,,,,,,,,,,,,,,,,
75.0,2022-04-13 11:19:39,上海市-上海市-杨浦区共青路119号,FK-C-123,张长银,13381736488,1.7,60.0,20.761245674740486,58,1,职工,0.0,3,2021.8,2021.9,2022.3,,0,2022.4.12,,1,0,5,1,2,16,1.0,0,1,1.0,2,8,,,,,,,,,,,,,,,,,,,,,,,,,,,,,,,,,,,,,,,核酸检测被传染,,,,,,,,,,,,,,,
76.0,2022-04-13 11:17:24,上海市-上海市-杨浦区定海,FK-C-124,柳红根,13918739814,1.73,75.0,25.0593070266297,61,1,装修工人,1.0,2,,,,"1,3",0,2022.04.10,2022.04.01,3,1,0,0,3,7.5,1.0,1,1,0.0,1,1,1,50,0,,工人,3,,,,,0,,,,,,,,,,,,,,,,,,,,,,,,,,做志愿者,,,,,,,,,,,,,,,,,
77.0,2022-04-13 11:15:42,上海市-上海市-杨浦区定海街道共青路119弄1号204室,FK-C-125,沈平,18016217169,1.67,67.0,24.023808670085,63,1,退休,1.0,3,,,2021.11,,8,2022.04.11,2022.04.01,3,1,"4,5",-2,2,6,1.0,0,1 2,0.0,2,8,,,,,,,,,,,0,,,,,,,,,,,,,,"4,6,7","3,2,2",,,,,"4,5,0","2,2,1",,,,,怀疑同住人,,,,,,,,,,,,,,,,,
78.0,2022-04-13 11:14:52,上海市-上海市-杨浦区共青路41号,FK-C-126,徐敏连,13062658598,1.6,75.0,29.296875,57,1,保安,0.0,3,,,2021.05,,0,2022.04.09,2022.04.06,3,1,5,0,3,4,1.0,1,1,0.0,1,1,1,50,0,1,保安,3,,,,,,,,,,,,,,,,,,,,,,,,,,,,,,,,,,,,,,,,,,,,,,,,
79.0,2022-04-13 11:12:43,上海市-上海市-杨浦区爱国路94号203室,FK-C-127,陆慈聪,13916325515,1.67,55.0,19.7210369679802,67,1,退休,0.0,0,,,,,13,2022.04.10,2022.04.01,1,未做,0,,1,7.5,0.0,0,1,0.0,1,4,2,60,11,1,退休,2,,,,,4,8,,,,,,,,,,,,,,,,,,,,,,,,,,,,,,,,,,,,,,,,,,
80.0,2022-04-13 11:12:44,上海市-上海市-杨浦区定海街道平凉路白洋淀薪村14号102室,FK-C-128,葛春桃,15821784957,1.65,70.0,25.7116620752984,49,1,自由职业,0.0,3,2021.04,2021.05,2021.12,"0,0",0,2022.04.12,,3,1,"4,5,7",3,1,17,1.0,0,3,1.0,2,8,,,,,,,,,,,3,3,,,,,,,,,,,,,4,2,,,,,4,2,48,0,0,自由职业,,,,,,,,,,,,,,,,,,
81.0,2022-04-12 14:06:17,上海市-上海市-杨浦区四平路街道,FK-C-129,王峥,15692172072,1.7,70.0,24.2214532871972,31,1,设计师,2.0,2,2021.04,2021.05,,2,13,2022.04.10,2022.04.06,3,0,5,7,3,17,1.0,1,1,0.0,1,4,2,28,0,2,企业,2,,,,,4,8,,,,,,,,,,,,,8,,,,,,4,2,,,,,,,,,,,,,,,,,,,,,,
83.0,2022-04-12 14:13:19,上海市-上海市-杨浦区阜新路180弄13号305室,FK-C-131,张舟平,15800932928,1.72,80.0,27.0416441319632,54,1,待业,2.0,3,2021.04,2021.05,2021.11,,0,2022.04.09,2022.04.04,2,1,"4,5",0,1,48,1.0,0,1,0.0,2,8,,,,,,,,,,,,,,,,,,,,,,,,,,,,,,,,,,,,,,,,,,,,,,,,,,,,,,
84.0,2022-04-12 14:44:35,上海市-上海市-杨浦区内江路,FK-C-132,除孝平,17721383573,1.55,60.0,24.9739854318418,59,1,保洁,0.0,3,,2021.04,2021.1,,2,2022.04.09,2022.04.04,3,1,5,-5,3,10,0.0,1,"1,3",1.0,2,8,,,,,,打过,,,,,,,,,,,,,,,,,,,,,,,,,,,,,,,工作区域,,,,,,,,,,,,,,,,,
85.0,2022-04-12 14:38:09,上海市-上海市-杨浦区内江路9号,FK-C-133,刘平康,19993814785,1.65,56.0,20.5693296602388,55,1,保洁,0.0,3,2021.04,2021.07,2021.1,3,8,2022.04.09,2022.04.04,3,1,"4,5",2,3,5,0.0,1,"1,2",0.0,1,1,1,53,8,0,保洁,3,,,,,,8,,,,,,,,,,,,,8,,,,,,,,,,,,怀疑同住人,,,,,,,,,,,,,,,,,
86.0,2022-04-12 14:46:53,上海市-上海市-杨浦区定海路,FK-C-134,茆守敬,13817230549,1.66,75.0,27.2173029467267,53,1,保安,0.0,3,,2021.05,2021.11,,2,2022.04.06,2022.04.04,2,1,"4,7",3,3,15,0.0,1,1,0.0,2,8,,,,,,,,,,,,8,,,,,,,,,,,,,1,,,,,,,,,,,,,,,,,,,,,,,,,,,,,
87.0,2022-04-12 14:36:09,上海市-上海市-杨浦区定海路街道,FK-C-135,李鹏乐,18317617032,1.66,66.0,23.9512265931195,19,1,保安,0.0,2,,2021.06,,,0,2022.04.09,2022.04.06,1,1,5,-5,1,7.5,0.0,,1,0.0,2,8,,,,,,,,,,,,,,,,,,,,,,,,,1,3,,,,2022.04.09,4,1,33,0,0,,,,,,,,,,,,,,,,,,,
89.0,2022-04-12 14:39:13,上海市-上海市-黄浦区周家嘴路,FK-C-137,朱建辉,18337593886,1.7,63.0,21.7993079584775,50,1,保安,0.0,2,,2021.06,,,0,2022.04.12,2022.04.06,2,未做,7,-2,2,,1.0,0,1,1.0,3,0,,,,,,,,,,,,,,,,,,,,,,,,,,,,,,,,,,,,,,,,,,,,,,,,,,,,,,
90.0,2022-04-12 14:34:37,上海市-上海市-杨浦区定海路街道平凉路2767弄333号平房,FK-C-138,赵红艳,17701787723,,,,33,1,装修工人,0.0,3,2021.03,2021.05,2021.12,打过,0,2022.04.11,2022.04.01,3,1,"4,5",-5,3,3,0.0,1,2,0.0,2,8,,,,,,,,,,,,,,,,,,,,,,,,,,,,,,,,,,,,,,,,,,,,,,,,,,,,,,